Reaction Details
TargetAcetyl-CoA carboxylase 1
LigandBDBM50069756
Substrate/Competitorn/a
Meas. Tech.ChEMBL_1843856 (CHEMBL4344283)
IC50 1.7±n/a nM
Citation Romero, FAJones, CTXu, YFenaux, MHalcomb, RL The Race to Bash NASH: Emerging Targets and Drug Development in a Complex Liver Disease. J Med Chem63:5031-5073 (2020) 
 
Acetyl-CoA carboxylase 1
Name:Acetyl-CoA carboxylase 1
Type:Protein
Mol. Mass.:265543.22
Organism:Homo sapiens (Human)
Description:Q13085
Residue:2346
BDBM50069756
NameBDBM50069756
Synonyms:CHEMBL3407547 ND-630 US10995099, Example 38 | US11186587, Example ND-630
TypeSmall organic molecule
Emp. Form.C28H31N3O8S
Mol. Mass.569.626
SMILESCOc1ccccc1[C@H](Cn1c2sc(c(C)c2c(=O)n(c1=O)C(C)(C)C(O)=O)-c1ncco1)OC1CCOCC1