Reaction Details
TargetGlycogen phosphorylase, liver form
LigandBDBM35346
Substrate/Competitorn/a
Meas. Tech.ChEMBL_99040 (CHEMBL712593)
IC50 205±n/a nM
Citation Hoover, DJLefkowitz-Snow, SBurgess-Henry, JLMartin, WHArmento, SJStock, IAMcPherson, RKGenereux, PEGibbs, EMTreadway, JL Indole-2-carboxamide inhibitors of human liver glycogen phosphorylase. J Med Chem41:2934-8 (1998) 
 
Glycogen phosphorylase, liver form
Name:Glycogen phosphorylase, liver form
Type:Homodimer
Mol. Mass.:97153.98
Organism:Homo sapiens (Human)
Description:Dimers associate into a tetramer to form the enzymatically active phosphorylase A.
Residue:847
BDBM35346
NameBDBM35346
Synonyms:(S)-5-chloro-N-(3-(4-fluorophenyl)-1-(4-hydroxypiperidin-1-yl)-1-oxopropan-2-yl)-1H-indole-2-carboxamide 5-Chloro-1H-indole-2-carboxylic acid [(S)-1-(4-fluoro-benzyl)-2-(4-hydroxy-piperidin-1-yl)-2-oxo-ethyl]-amide CP-320626
TypeSmall organic molecule
Emp. Form.C23H23ClFN3O3
Mol. Mass.443.898
SMILESOC1CCN(CC1)C(=O)[C@H](Cc1ccc(F)cc1)NC(=O)c1cc2cc(Cl)ccc2[nH]1