Reaction Details
TargetProthrombin
LigandBDBM50066338
Substrate/Competitorn/a
Meas. Tech.ChEMBL_208318 (CHEMBL812836)
Ki 0.45±n/a nM
Citation Tucker, TJBrady, SFLumma, WCLewis, SDGardell, SJNaylor-Olsen, AMYan, YSisko, JTStauffer, KJLucas, BJLynch, JJCook, JJStranieri, MTHolahan, MALyle, EABaskin, EPChen, IWDancheck, KBKrueger, JACooper, CMVacca, JP Design and synthesis of a series of potent and orally bioavailable noncovalent thrombin inhibitors that utilize nonbasic groups in the P1 position. J Med Chem41:3210-9 (1998) 
 
Prothrombin
Name:Prothrombin
Type:Protein
Mol. Mass.:70029.57
Organism:Homo sapiens (Human)
Description:P00734
Residue:622
BDBM50066338
NameBDBM50066338
Synonyms:CHEMBL327115 | [2-({[(S)-1-((R)-2-Amino-2-cyclohexyl-acetyl)-pyrrolidine-2-carbonyl]-amino}-methyl)-4-chloro-phenoxy]-acetic acid ethyl ester
TypeSmall organic molecule
Emp. Form.C24H34ClN3O5
Mol. Mass.479.997
SMILESCCOC(=O)COc1ccc(Cl)cc1CNC(=O)[C@@H]1CCCN1C(=O)[C@H](N)C1CCCCC1