Reaction Details
TargetChymotrypsinogen A
LigandBDBM50066334
Substrate/Competitorn/a
Meas. Tech.ChEMBL_49753 (CHEMBL662085)
Ki 71000±n/a nM
Citation Tucker, TJBrady, SFLumma, WCLewis, SDGardell, SJNaylor-Olsen, AMYan, YSisko, JTStauffer, KJLucas, BJLynch, JJCook, JJStranieri, MTHolahan, MALyle, EABaskin, EPChen, IWDancheck, KBKrueger, JACooper, CMVacca, JP Design and synthesis of a series of potent and orally bioavailable noncovalent thrombin inhibitors that utilize nonbasic groups in the P1 position. J Med Chem41:3210-9 (1998) 
 
Chymotrypsinogen A
Name:Chymotrypsinogen A
Type:Serine protease
Mol. Mass.:25670.88
Organism:Bos taurus (bovine)
Description:n/a
Residue:245
BDBM50066334
NameBDBM50066334
Synonyms:(S)-1-((R)-2-Amino-2-cyclohexyl-acetyl)-pyrrolidine-2-carboxylic acid 5-chloro-2-ethylcarbamoylmethoxy-benzylamide 1-[2-AMINO-2-CYCLOHEXYL-ACETYL]-PYRROLIDINE-3-CARBOXYLIC ACID 5-CHLORO-2-(2-ETHYLCARBAMOYL-ETHOXY)-BENZYLAMIDE | CHEMBL42039
TypeSmall organic molecule
Emp. Form.C24H35ClN4O4
Mol. Mass.479.012
SMILESCCNC(=O)COc1ccc(Cl)cc1CNC(=O)[C@@H]1CCCN1C(=O)[C@H](N)C1CCCCC1