Reaction Details
TargetSerine protease 1
LigandBDBM50066331
Substrate/Competitorn/a
Meas. Tech.ChEMBL_212735 (CHEMBL819276)
Ki 27000±n/a nM
Citation Tucker, TJBrady, SFLumma, WCLewis, SDGardell, SJNaylor-Olsen, AMYan, YSisko, JTStauffer, KJLucas, BJLynch, JJCook, JJStranieri, MTHolahan, MALyle, EABaskin, EPChen, IWDancheck, KBKrueger, JACooper, CMVacca, JP Design and synthesis of a series of potent and orally bioavailable noncovalent thrombin inhibitors that utilize nonbasic groups in the P1 position. J Med Chem41:3210-9 (1998) 
 
Serine protease 1
Name:Serine protease 1
Type:Enzyme
Mol. Mass.:26557.80
Organism:Homo sapiens (Human)
Description:P07477
Residue:247
BDBM50066331
NameBDBM50066331
Synonyms:(S)-1-[(R)-2-Cyclohexyl-2-(diethylcarbamoylmethyl-amino)-acetyl]-pyrrolidine-2-carboxylic acid 2,5-dichloro-benzylamide | CHEMBL441468
TypeSmall organic molecule
Emp. Form.C26H38Cl2N4O3
Mol. Mass.525.511
SMILESCCN(CC)C(=O)CN[C@H](C1CCCCC1)C(=O)N1CCC[C@H]1C(=O)NCc1cc(Cl)ccc1Cl