Reaction Details
TargetReverse transcriptase/RNaseH
LigandBDBM50066468
Substrate/Competitorn/a
Meas. Tech.ChEMBL_195842 (CHEMBL799141)
IC50 29±n/a nM
Citation Bold, GFässler, ACapraro, HGCozens, RKlimkait, TLazdins, JMestan, JPoncioni, BRösel, JStover, DTintelnot-Blomley, MAcemoglu, FBeck, WBoss, EEschbach, MHürlimann, TMasso, ERoussel, SUcci-Stoll, KWyss, DLang, M New aza-dipeptide analogues as potent and orally absorbed HIV-1 protease inhibitors: candidates for clinical development. J Med Chem41:3387-401 (1998) 
 
Reverse transcriptase/RNaseH
Name:Reverse transcriptase/RNaseH
Type:PROTEIN
Mol. Mass.:65229.15
Organism:Human immunodeficiency virus 1
Description:ChEMBL_1473730
Residue:566
BDBM50066468
NameBDBM50066468
Synonyms:CHEMBL324521 | {(S)-1-[N'-[(2S,3S)-2-Hydroxy-3-((S)-2-methoxycarbonylamino-3-methyl-butyrylamino)-4-phenyl-butyl]-N'-(4-pyridin-2-yl-benzyl)-hydrazinocarbonyl]-2-methyl-propyl}-carbamic acid methyl ester
TypeSmall organic molecule
Emp. Form.C36H48N6O7
Mol. Mass.676.8023
SMILESCOC(=O)N[C@@H](C(C)C)C(=O)N[C@@H](Cc1ccccc1)[C@@H](O)CN(Cc1ccc(cc1)-c1ccccn1)NC(=O)[C@@H](NC(=O)OC)C(C)C