Reaction Details
TargetReverse transcriptase/RNaseH
LigandBDBM50066477
Substrate/Competitorn/a
Meas. Tech.ChEMBL_195842 (CHEMBL799141)
IC50 41±n/a nM
Citation Bold, GFässler, ACapraro, HGCozens, RKlimkait, TLazdins, JMestan, JPoncioni, BRösel, JStover, DTintelnot-Blomley, MAcemoglu, FBeck, WBoss, EEschbach, MHürlimann, TMasso, ERoussel, SUcci-Stoll, KWyss, DLang, M New aza-dipeptide analogues as potent and orally absorbed HIV-1 protease inhibitors: candidates for clinical development. J Med Chem41:3387-401 (1998) 
 
Reverse transcriptase/RNaseH
Name:Reverse transcriptase/RNaseH
Type:PROTEIN
Mol. Mass.:65229.15
Organism:Human immunodeficiency virus 1
Description:ChEMBL_1473730
Residue:566
BDBM50066477
NameBDBM50066477
Synonyms:((S)-1-{N'-(4-Diethylamino-benzyl)-N'-[(2S,3S)-2-hydroxy-3-((S)-2-methoxycarbonylamino-3,3-dimethyl-butyrylamino)-4-phenyl-butyl]-hydrazinocarbonyl}-2,2-dimethyl-propyl)-carbamic acid methyl ester | CHEMBL324601
TypeSmall organic molecule
Emp. Form.C37H58N6O7
Mol. Mass.698.8924
SMILESCCN(CC)c1ccc(CN(C[C@H](O)[C@H](Cc2ccccc2)NC(=O)[C@@H](NC(=O)OC)C(C)(C)C)NC(=O)[C@@H](NC(=O)OC)C(C)(C)C)cc1