Reaction Details
TargetATP-citrate synthase
LigandBDBM50066674
Substrate/Competitorn/a
Meas. Tech.ChEMBL_29508 (CHEMBL643074)
Ki 18000±n/a nM
Citation Gribble, ADIfe, RJShaw, AMcNair, DNovelli, CEBakewell, SShah, VPDolle, REGroot, PHPearce, NYates, JTew, DBoyd, HAshman, SEggleston, DSHaltiwanger, RCOkafo, G ATP-Citrate lyase as a target for hypolipidemic intervention. 2. Synthesis and evaluation of (3R,5S)-omega-substituted-3-carboxy-3, 5-dihydroxyalkanoic acids and their gamma-lactone prodrugs as inhibitors of the enzyme in vitro and in vivo. J Med Chem41:3582-95 (1998) 
 
ATP-citrate synthase
Name:ATP-citrate synthase
Type:PROTEIN
Mol. Mass.:120848.43
Organism:Homo sapiens (Human)
Description:ChEMBL_455196
Residue:1101
BDBM50066674
NameBDBM50066674
Synonyms:(R)-2-[(S)-9-(2,4-Dichloro-phenyl)-1-hydroxy-nonyl]-2-hydroxy-succinic acid | CHEMBL325656
TypeSmall organic molecule
Emp. Form.C19H26Cl2O6
Mol. Mass.421.312
SMILESO[C@@H](CCCCCCCCc1ccc(Cl)cc1Cl)[C@](O)(CC(O)=O)C(O)=O