Reaction Details
TargetATP-citrate synthase
LigandBDBM50066681
Substrate/Competitorn/a
Meas. Tech.ChEMBL_29508 (CHEMBL643074)
Ki 21000±n/a nM
Citation Gribble, ADIfe, RJShaw, AMcNair, DNovelli, CEBakewell, SShah, VPDolle, REGroot, PHPearce, NYates, JTew, DBoyd, HAshman, SEggleston, DSHaltiwanger, RCOkafo, G ATP-Citrate lyase as a target for hypolipidemic intervention. 2. Synthesis and evaluation of (3R,5S)-omega-substituted-3-carboxy-3, 5-dihydroxyalkanoic acids and their gamma-lactone prodrugs as inhibitors of the enzyme in vitro and in vivo. J Med Chem41:3582-95 (1998) 
 
ATP-citrate synthase
Name:ATP-citrate synthase
Type:PROTEIN
Mol. Mass.:120848.43
Organism:Homo sapiens (Human)
Description:ChEMBL_455196
Residue:1101
BDBM50066681
NameBDBM50066681
Synonyms:(S)-2-Hydroxy-2-[(R)-2-hydroxy-8-(5,2',4'-trichloro-biphenyl-2-yl)-octyl]-succinic acid | CHEMBL118408
TypeSmall organic molecule
Emp. Form.C24H27Cl3O6
Mol. Mass.517.827
SMILESO[C@H](CCCCCCc1ccc(Cl)cc1-c1ccc(Cl)cc1Cl)C[C@](O)(CC(O)=O)C(O)=O