Reaction Details
TargetATP-citrate synthase
LigandBDBM50066694
Substrate/Competitorn/a
Meas. Tech.ChEMBL_29508 (CHEMBL643074)
Ki 220±n/a nM
Citation Gribble, ADIfe, RJShaw, AMcNair, DNovelli, CEBakewell, SShah, VPDolle, REGroot, PHPearce, NYates, JTew, DBoyd, HAshman, SEggleston, DSHaltiwanger, RCOkafo, G ATP-Citrate lyase as a target for hypolipidemic intervention. 2. Synthesis and evaluation of (3R,5S)-omega-substituted-3-carboxy-3, 5-dihydroxyalkanoic acids and their gamma-lactone prodrugs as inhibitors of the enzyme in vitro and in vivo. J Med Chem41:3582-95 (1998) 
 
ATP-citrate synthase
Name:ATP-citrate synthase
Type:PROTEIN
Mol. Mass.:120848.43
Organism:Homo sapiens (Human)
Description:ChEMBL_455196
Residue:1101
BDBM50066694
NameBDBM50066694
Synonyms:(S)-2-[(R)-7-(3-Chloro-9H-fluoren-9-yl)-2-hydroxy-heptyl]-2-hydroxy-succinic acid | CHEMBL120302
TypeSmall organic molecule
Emp. Form.C24H27ClO6
Mol. Mass.446.921
SMILESO[C@H](CCCCCC1c2ccccc2-c2cc(Cl)ccc12)C[C@](O)(CC(O)=O)C(O)=O