Reaction Details
TargetATP-citrate synthase
LigandBDBM50066693
Substrate/Competitorn/a
Meas. Tech.ChEMBL_29508 (CHEMBL643074)
Ki 3200±n/a nM
Citation Gribble, ADIfe, RJShaw, AMcNair, DNovelli, CEBakewell, SShah, VPDolle, REGroot, PHPearce, NYates, JTew, DBoyd, HAshman, SEggleston, DSHaltiwanger, RCOkafo, G ATP-Citrate lyase as a target for hypolipidemic intervention. 2. Synthesis and evaluation of (3R,5S)-omega-substituted-3-carboxy-3, 5-dihydroxyalkanoic acids and their gamma-lactone prodrugs as inhibitors of the enzyme in vitro and in vivo. J Med Chem41:3582-95 (1998) 
 
ATP-citrate synthase
Name:ATP-citrate synthase
Type:PROTEIN
Mol. Mass.:120848.43
Organism:Homo sapiens (Human)
Description:ChEMBL_455196
Residue:1101
BDBM50066693
NameBDBM50066693
Synonyms:(S)-2-[(R)-8-(5-Chloro-indol-1-yl)-2-hydroxy-octyl]-2-hydroxy-succinic acid | CHEMBL123646
TypeSmall organic molecule
Emp. Form.C20H26ClNO6
Mol. Mass.411.877
SMILESO[C@H](CCCCCCn1ccc2cc(Cl)ccc12)C[C@](O)(CC(O)=O)C(O)=O