Reaction Details
TargetDelta-type opioid receptor
LigandBDBM50067447
Substrate/Competitorn/a
Meas. Tech.ChEMBL_147279 (CHEMBL755201)
Ki 13±n/a nM
Citation Thomas, JBZheng, XMascarella, SWRothman, RBDersch, CMPartilla, JSFlippen-Anderson, JLGeorge, CFCantrell, BEZimmerman, DMCarroll, FI N-Substituted 9beta-methyl-5-(3-hydroxyphenyl)morphans are opioid receptor pure antagonists. J Med Chem41:4143-9 (1998) 
 
Delta-type opioid receptor
Name:Delta-type opioid receptor
Type:G Protein-Coupled Receptor (GPCR)
Mol. Mass.:40382.98
Organism:Homo sapiens (Human)
Description:Competition binding assays were carried out using membrane preparations from transfected HN9.10 cells that constitutively expressed the delta opioid receptor.
Residue:372
BDBM50067447
NameBDBM50067447
Synonyms:3-((R)-9-Methyl-2-phenethyl-2-aza-bicyclo[3.3.1]non-5-yl)-phenol | CHEMBL334898
TypeSmall organic molecule
Emp. Form.C23H29NO
Mol. Mass.335.4825
SMILESC[C@H]1C2CCCC1(CCN2CCc1ccccc1)c1cccc(O)c1