Reaction Details
TargetMu-type opioid receptor
LigandBDBM50045772
Substrate/Competitorn/a
Meas. Tech.ChEMBL_149315 (CHEMBL757310)
Ki 80±n/a nM
Citation Thomas, JBZheng, XMascarella, SWRothman, RBDersch, CMPartilla, JSFlippen-Anderson, JLGeorge, CFCantrell, BEZimmerman, DMCarroll, FI N-Substituted 9beta-methyl-5-(3-hydroxyphenyl)morphans are opioid receptor pure antagonists. J Med Chem41:4143-9 (1998) 
 
Mu-type opioid receptor
Name:Mu-type opioid receptor
Type:G Protein-Coupled Receptor (GPCR)
Mol. Mass.:44789.51
Organism:Homo sapiens (Human)
Description:P35372
Residue:400
BDBM50045772
NameBDBM50045772
Synonyms:3-((3R,4R)-1,3,4-Trimethyl-piperidin-4-yl)-phenol CHEMBL318723
TypeSmall organic molecule
Emp. Form.C14H21NO
Mol. Mass.219.3226
SMILESC[C@H]1CN(C)CC[C@@]1(C)c1cccc(O)c1