Reaction Details
TargetProthrombin
LigandBDBM50067528
Substrate/Competitorn/a
Meas. Tech.ChEMBL_210593 (CHEMBL816560)
Ki 15000±n/a nM
Citation Gabriel, BStubbs, MTBergner, AHauptmann, JBode, WStürzebecher, JMoroder, L Design of benzamidine-type inhibitors of factor Xa. J Med Chem41:4240-50 (1998) 
 
Prothrombin
Name:Prothrombin
Type:Enzyme
Mol. Mass.:70502.73
Organism:Bos taurus (Bovine)
Description:P00735
Residue:625
BDBM50067528
NameBDBM50067528
Synonyms:3-(3-Carbamimidoyl-phenyl)-2-[2-(4-thiocarbamoyl-benzenesulfonylamino)-acetylamino]-propionic acid ethyl ester | CHEMBL336844
TypeSmall organic molecule
Emp. Form.C21H25N5O5S2
Mol. Mass.491.584
SMILESCCOC(=O)C(Cc1cccc(c1)C(N)=N)NC(=O)CNS(=O)(=O)c1ccc(cc1)C(N)=S