Reaction Details
TargetCoagulation factor X
LigandBDBM50067528
Substrate/Competitorn/a
Meas. Tech.ChEMBL_48811 (CHEMBL662834)
Ki 640±n/a nM
Citation Gabriel, BStubbs, MTBergner, AHauptmann, JBode, WStürzebecher, JMoroder, L Design of benzamidine-type inhibitors of factor Xa. J Med Chem41:4240-50 (1998) 
 
Coagulation factor X
Name:Coagulation factor X
Type:Enzyme
Mol. Mass.:54726.60
Organism:Homo sapiens (Human)
Description:n/a
Residue:488
BDBM50067528
NameBDBM50067528
Synonyms:3-(3-Carbamimidoyl-phenyl)-2-[2-(4-thiocarbamoyl-benzenesulfonylamino)-acetylamino]-propionic acid ethyl ester | CHEMBL336844
TypeSmall organic molecule
Emp. Form.C21H25N5O5S2
Mol. Mass.491.584
SMILESCCOC(=O)C(Cc1cccc(c1)C(N)=N)NC(=O)CNS(=O)(=O)c1ccc(cc1)C(N)=S