Reaction Details
TargetLysine-specific demethylase 4B
LigandBDBM50513360
Substrate/Competitorn/a
Meas. Tech.ChEMBL_1853065 (CHEMBL4353689)
IC50 29±n/a nM
Citation Le Bihan, YVLanigan, RMAtrash, BMcLaughlin, MGVelupillai, SMalcolm, AGEngland, KSRuda, GFMok, NYTumber, ATomlin, KSaville, HShehu, EMcAndrew, CCarmichael, LBennett, JMJeganathan, FEve, PDonovan, AHayes, AWood, FRaynaud, FIFedorov, OBrennan, PEBurke, Rvan Montfort, RLMRossanese, OWBlagg, JBavetsias, V C8-substituted pyrido[3,4-d]pyrimidin-4(3H)-ones: Studies towards the identification of potent, cell penetrant Jumonji C domain containing histone lysine demethylase 4 subfamily (KDM4) inhibitors, compound profiling in cell-based target engagement assays. Eur J Med Chem177:316-337 (2019) 
 
Lysine-specific demethylase 4B
Name:Lysine-specific demethylase 4B
Type:PROTEIN
Mol. Mass.:121904.33
Organism:Homo sapiens (Human)
Description:ChEMBL_109446
Residue:1096
BDBM50513360
NameBDBM50513360
Synonyms:CHEMBL4573390
TypeSmall organic molecule
Emp. Form.C24H25ClN6O
Mol. Mass.448.948
SMILESCC1(CCN(CCc2cnn(c2)-c2nccc3c2nc[nH]c3=O)CC1)c1cccc(Cl)c1