Reaction Details
TargetMitogen-activated protein kinase kinase kinase 20
LigandBDBM50513871
Substrate/Competitorn/a
Meas. Tech.ChEMBL_1854813 (CHEMBL4355542)
IC50 53±n/a nM
Citation Yang, JShibu, MAKong, LLuo, JBadrealamKhan, FHuang, YTu, ZCYun, CHHuang, CYDing, KLu, X Design, Synthesis, and Structure-Activity Relationships of 1,2,3-Triazole Benzenesulfonamides as New Selective Leucine-Zipper and Sterile-? Motif Kinase (ZAK) Inhibitors. J Med Chem63:2114-2130 (2020) 
 
Mitogen-activated protein kinase kinase kinase 20
Name:Mitogen-activated protein kinase kinase kinase 20
Type:PROTEIN
Mol. Mass.:91168.58
Organism:Homo sapiens (Human)
Description:ChEMBL_1495629
Residue:800
BDBM50513871
NameBDBM50513871
Synonyms:CHEMBL4532800
TypeSmall organic molecule
Emp. Form.C22H15ClF2N8O2
Mol. Mass.496.857
SMILESCOc1n[nH]c2ncc(cc12)-c1cn(nn1)-c1c(F)ccc(NC(=O)Nc2cccc(Cl)c2)c1F