Reaction Details
TargetMitogen-activated protein kinase kinase kinase 20
LigandBDBM50513874
Substrate/Competitorn/a
Meas. Tech.ChEMBL_1854813 (CHEMBL4355542)
IC50 25±n/a nM
Citation Yang, JShibu, MAKong, LLuo, JBadrealamKhan, FHuang, YTu, ZCYun, CHHuang, CYDing, KLu, X Design, Synthesis, and Structure-Activity Relationships of 1,2,3-Triazole Benzenesulfonamides as New Selective Leucine-Zipper and Sterile-? Motif Kinase (ZAK) Inhibitors. J Med Chem63:2114-2130 (2020) 
 
Mitogen-activated protein kinase kinase kinase 20
Name:Mitogen-activated protein kinase kinase kinase 20
Type:PROTEIN
Mol. Mass.:91168.58
Organism:Homo sapiens (Human)
Description:ChEMBL_1495629
Residue:800
BDBM50513874
NameBDBM50513874
Synonyms:CHEMBL4476053
TypeSmall organic molecule
Emp. Form.C21H16ClN7O3S
Mol. Mass.481.915
SMILESCOc1n[nH]c2ncc(cc12)-c1cn(nn1)-c1cccc(NS(=O)(=O)c2cccc(Cl)c2)c1