Reaction Details
TargetCysteinyl leukotriene receptor 1/2
LigandBDBM50069356
Substrate/Competitorn/a
Meas. Tech.ChEMBL_99858 (CHEMBL706928)
IC50 0.190000±n/a nM
Citation Guay, DGauthier, JYDufresne, CJones, TRMcAuliffe, MMcFarlane, CMetters, KMPrasit, PRochette, CRoy, PSawyer, NZamboni, R A series of non-quinoline cysLT1 receptor antagonists: SAR study on pyridyl analogs of Singulair. Bioorg Med Chem Lett8:453-8 (1999) Cysteinyl leukotriene receptor 1/2
Name:Cysteinyl leukotriene receptor 1/2
Synonyms:Cysteinyl leukotriene receptor
Type:n/a
Mol. Mass.:n/a
Description:ASSAY_ID of ChEMBL is 98640
Components:This complex has 2 components.
Component 1
Name:Cysteinyl leukotriene receptor 1
Type:Enzyme Catalytic Domain
Mol. Mass.:38565.16
Organism:Homo sapiens (Human)
Description:Leukotriene Cysteinyl 1 CYSLTR1 HUMAN::Q9Y271
Residue:337
Component 2
Name:Cysteinyl leukotriene receptor 2
Synonyms:CLTR2_HUMAN CYSLT2R Cysteinyl leukotriene receptor Leukotriene Cysteinyl 2
Type:Enzyme Catalytic Domain
Mol. Mass.:39657.52
Organism:Homo sapiens (Human)
Description:Leukotriene Cysteinyl 2 CYSLTR2 HUMAN::Q9NS75
Residue:346
BDBM50069356
NameBDBM50069356
Synonyms:(R)-2-(1-((3-(2-(2-hydroxypropan-2-yl)phenyl)-1-(3-(2-(5,6,7,8-tetrahydroquinolin-2-yl)vinyl)phenyl)propylthio)methyl)cyclopropyl)acetic acid [1-((R)-3-[2-(1-Hydroxy-1-methyl-ethyl)-phenyl]-1-{3-[(E)-2-(5,6,7,8-tetrahydro-quinolin-2-yl)-vinyl]-phenyl}-propylsulfanylmethyl)-cyclopropyl]-acetic acid
TypeSmall organic molecule
Emp. Form.C35H41NO3S
Mol. Mass.555.77
SMILESCC(C)(O)c1ccccc1CC[C@@H](SCC1(CC(O)=O)CC1)c1cccc(\C=C\c2ccc3CCCCc3n2)c1