Reaction Details
TargetATPase family AAA domain-containing protein 2
LigandBDBM50514871
Substrate/Competitorn/a
Meas. Tech.ChEMBL_1858860 (CHEMBL4359589)
IC50 25±n/a nM
Citation Lucas, SCCAtkinson, SJBamborough, PBarnett, HChung, CWGordon, LMitchell, DJPhillipou, APrinjha, RKSheppard, RJTomkinson, NCOWatson, RJDemont, EH Optimization of Potent ATAD2 and CECR2 Bromodomain Inhibitors with an Atypical Binding Mode. J Med Chem63:5212-5241 (2020) 
 
ATPase family AAA domain-containing protein 2
Name:ATPase family AAA domain-containing protein 2
Type:PROTEIN
Mol. Mass.:158546.30
Organism:Homo sapiens (Human)
Description:ChEMBL_1500426
Residue:1390
BDBM50514871
NameBDBM50514871
Synonyms:CHEMBL4576280
TypeSmall organic molecule
Emp. Form.C21H27BrN4O5S
Mol. Mass.527.432
SMILESC[C@@H]1CN(C[C@H]1C)S(=O)(=O)c1cc(NC(=O)CN2C(=O)NC(C)(C3CC3)C2=O)ccc1Br