Reaction Details
TargetAromatase
LigandBDBM8611
Substrate/Competitorn/a
Meas. Tech.ChEMBL_36052 (CHEMBL645584)
IC50 200±n/a nM
Citation Sonnet, PGuillon, JEnguehard, CDallemagne, PBureau, RRault S Auvray, PMoslemi, SSourdiane, PGalopin, SSéralini, GE Design and synthesis of a new type of non steroidal human aromatase inhibitors. Bioorg Med Chem Lett8:1041-4 (1999) Aromatase
Name:Aromatase
Type:Enzyme
Mol. Mass.:57888.92
Organism:Homo sapiens (Human)
Description:P11511
Residue:503
BDBM8611
NameBDBM8611
Synonyms:4-{5H,6H,7H,8H-imidazo[1,5-a]pyridin-5-yl}benzonitrile CHEMBL9298 US9271963, Fadrozole
TypeSmall organic molecule
Emp. Form.C14H13N3
Mol. Mass.223.2731
SMILESN#Cc1ccc(cc1)C1CCCc2cncn12