Reaction Details
TargetHistamine H3 receptor
LigandBDBM22914
Substrate/Competitorn/a
Meas. Tech.ChEMBL_86750 (CHEMBL693560)
Ki 1.5±n/a nM
Citation Ali, SMTedford, CEGregory, RYates, SLPhillips, JG New acetylene based histamine H3 receptor antagonists derived from the marine natural product verongamine. Bioorg Med Chem Lett8:1133-8 (1999) Histamine H3 receptor
Name:Histamine H3 receptor
Type:G Protein-Coupled Receptor (GPCR)
Mol. Mass.:48607.98
Organism:Rattus norvegicus (rat)
Description:n/a
Residue:445
BDBM22914
NameBDBM22914
Synonyms:CHEMBL260374 Thioperamide | US11622967, Compound Thioperamide
TypeSmall organic molecule
Emp. Form.C15H24N4S
Mol. Mass.292.443
SMILESS=C(NC1CCCCC1)N1CCC(CC1)c1cnc[nH]1