Reaction Details
TargetHistamine H3 receptor
LigandBDBM50070214
Substrate/Competitorn/a
Meas. Tech.ChEBML_86750
Ki 0.800000±n/a nM
Citation Ali, SMTedford, CEGregory, RYates, SLPhillips, JG New acetylene based histamine H3 receptor antagonists derived from the marine natural product verongamine. Bioorg Med Chem Lett8:1133-8 (1999) Histamine H3 receptor
Name:Histamine H3 receptor
Type:G Protein-Coupled Receptor (GPCR)
Mol. Mass.:48607.98
Organism:Rattus norvegicus (rat)
Description:n/a
Residue:445
BDBM50070214
NameBDBM50070214
Synonyms:4-(7,7-Dimethyl-oct-3-ynyl)-1H-imidazole GT 2293
TypeSmall organic molecule
Emp. Form.C13H20N2
Mol. Mass.204.3113
SMILESCC(C)(C)CCC#CCCc1cnc[nH]1