Reaction Details
TargetOxysterols receptor LXR-beta
LigandBDBM50355501
Substrate/Competitorn/a
Meas. Tech.ChEMBL_1859653 (CHEMBL4360509)
Ki 45000±n/a nM
Citation Zhang, ZChen, HChen, ZDing, PJu, YGu, QXu, JZhou, H Identify liver X receptor ? modulator building blocks by developing a fluorescence polarization-based competition assay. Eur J Med Chem178:458-467 (2019) 
 
Oxysterols receptor LXR-beta
Name:Oxysterols receptor LXR-beta
Type:Enzyme Catalytic Domain
Mol. Mass.:50978.79
Organism:Homo sapiens (Human)
Description:P55055
Residue:460
BDBM50355501
NameBDBM50355501
Synonyms:INCB-018424 RUXOLITINIB PHOSPHATE US10766894, Compound TABLE 1.1 US11203595, TABLE 1.1 | US11279703, TABLE 6.147
TypeSmall organic molecule
Emp. Form.C17H18N6
Mol. Mass.306.365
SMILESN#CC[C@H](C1CCCC1)n1cc(cn1)-c1ncnc2[nH]ccc12