Reaction Details
Target5-hydroxytryptamine receptor 4
LigandBDBM50515598
Substrate/Competitorn/a
Meas. Tech.ChEMBL_1861937 (CHEMBL4362793)
Ki 5.9±n/a nM
Citation Lanthier, CPayan, HLiparulo, IHatat, BLecoutey, CSince, MDavis, ABergamini, CClaeysen, SDallemagne, PBolognesi, MLRochais, C Novel multi target-directed ligands targeting 5-HT Eur J Med Chem182:0 (2019) 
 
5-hydroxytryptamine receptor 4
Name:5-hydroxytryptamine receptor 4
Type:Enzyme
Mol. Mass.:43767.54
Organism:Homo sapiens (Human)
Description:Q13639
Residue:388
BDBM50515598
NameBDBM50515598
Synonyms:CHEMBL4526049
TypeSmall organic molecule
Emp. Form.C22H27ClN2O4
Mol. Mass.418.914
SMILESCOc1cc(N)c(Cl)cc1C(=O)CCC1CCN(Cc2ccc(O)c(O)c2)CC1