Reaction Details
TargetProthrombin
LigandBDBM50070787
Substrate/Competitorn/a
Meas. Tech.ChEBML_208333
Ki 160±n/a nM
Citation Naylor-Olsen, AMPonticello, GSLewis, SDMulichak, AMChen, ZHabecker, CNPhillips, BTSanders, WMTucker, TJShafer, JAVacca, JP Identification and SAR for a selective, nonpeptidyl thrombin inhibitor. Bioorg Med Chem Lett8:1697-702 (1999) Prothrombin
Name:Prothrombin
Type:Protein
Mol. Mass.:70029.57
Organism:Homo sapiens (Human)
Description:P00734
Residue:622
BDBM50070787
NameBDBM50070787
Synonyms:4-Amino-1-[4-(1,3-diphenyl-propoxy)-benzyl]-pyridinium | CHEMBL47481
TypeSmall organic molecule
Emp. Form.C27H27N2O
Mol. Mass.395.5155
SMILES[NH2+]=c1ccn(Cc2ccc(OC(CCc3ccccc3)c3ccccc3)cc2)cc1