Reaction Details
TargetProthrombin
LigandBDBM50070789
Substrate/Competitorn/a
Meas. Tech.ChEBML_208333
Ki>500000±n/a nM
Citation Naylor-Olsen, AMPonticello, GSLewis, SDMulichak, AMChen, ZHabecker, CNPhillips, BTSanders, WMTucker, TJShafer, JAVacca, JP Identification and SAR for a selective, nonpeptidyl thrombin inhibitor. Bioorg Med Chem Lett8:1697-702 (1999) Prothrombin
Name:Prothrombin
Type:Protein
Mol. Mass.:70029.57
Organism:Homo sapiens (Human)
Description:P00734
Residue:622
BDBM50070789
NameBDBM50070789
Synonyms:1-(4-Benzyloxy-benzyl)-pyridinium | CHEMBL296280
TypeSmall organic molecule
Emp. Form.C19H18NO
Mol. Mass.276.3518
SMILESC(Oc1ccc(C[n+]2ccccc2)cc1)c1ccccc1