Reaction Details
TargetSerine protease 1
LigandBDBM50070788
Substrate/Competitorn/a
Meas. Tech.ChEBML_212738
Ki 568000±n/a nM
Citation Naylor-Olsen, AMPonticello, GSLewis, SDMulichak, AMChen, ZHabecker, CNPhillips, BTSanders, WMTucker, TJShafer, JAVacca, JP Identification and SAR for a selective, nonpeptidyl thrombin inhibitor. Bioorg Med Chem Lett8:1697-702 (1999) Serine protease 1
Name:Serine protease 1
Type:Enzyme
Mol. Mass.:26557.80
Organism:Homo sapiens (Human)
Description:P07477
Residue:247
BDBM50070788
NameBDBM50070788
Synonyms:CHEMBL48029 [2-(4-Benzyloxy-phenyl)-ethyl]-pyridin-4-yl-amine
TypeSmall organic molecule
Emp. Form.C20H20N2O
Mol. Mass.304.3856
SMILESC(Cc1ccc(OCc2ccccc2)cc1)Nc1ccncc1