Reaction Details
TargetSerine protease 1
LigandBDBM50070791
Substrate/Competitorn/a
Meas. Tech.ChEBML_212738
Ki 517000±n/a nM
Citation Naylor-Olsen, AMPonticello, GSLewis, SDMulichak, AMChen, ZHabecker, CNPhillips, BTSanders, WMTucker, TJShafer, JAVacca, JP Identification and SAR for a selective, nonpeptidyl thrombin inhibitor. Bioorg Med Chem Lett8:1697-702 (1999) Serine protease 1
Name:Serine protease 1
Type:Enzyme
Mol. Mass.:26557.80
Organism:Homo sapiens (Human)
Description:P07477
Residue:247
BDBM50070791
NameBDBM50070791
Synonyms:4-Amino-1-(4-benzhydryloxy-benzyl)-pyridinium | CHEMBL48016
TypeSmall organic molecule
Emp. Form.C25H23N2O
Mol. Mass.367.4624
SMILES[NH2+]=c1ccn(Cc2ccc(OC(c3ccccc3)c3ccccc3)cc2)cc1