Reaction Details
TargetRibosyldihydronicotinamide dehydrogenase [quinone]
LigandBDBM23926
Substrate/Competitorn/a
Meas. Tech.ChEMBL_1863015 (CHEMBL4363871)
IC50 900±n/a nM
Citation Hussein, BIkhmais, BKadirvel, MMagwaza, RNHalbert, GBryce, RAStratford, IJFreeman, S Discovery of potent 4-aminoquinoline hydrazone inhibitors of NRH:quinoneoxidoreductase-2 (NQO2). Eur J Med Chem182:0 (2019) 
 
Ribosyldihydronicotinamide dehydrogenase [quinone]
Name:Ribosyldihydronicotinamide dehydrogenase [quinone]
Type:Protein
Mol. Mass.:25917.25
Organism:Homo sapiens (Human)
Description:P16083
Residue:231
BDBM23926
NameBDBM23926
Synonyms:(E)-resveratrol CHEMBL165 Stilbene, 2f cid_445154 trans-resveratrol
TypeSmall organic molecule
Emp. Form.C14H12O3
Mol. Mass.228.2433
SMILESOc1ccc(\C=C\c2cc(O)cc(O)c2)cc1