Reaction Details
TargetDelta-type opioid receptor
LigandBDBM50070948
Substrate/Competitorn/a
Meas. Tech.ChEBML_147139
Ki 2409±n/a nM
Citation Tsai, YCLiou, JPLiao, RCheng, CYTao, PL C-alkylated spiro[benzofuran-3(2H),4'-1'-methyl-piperidine-7-ols] as potent opioids: a conformation-activity study. Bioorg Med Chem Lett8:1813-8 (1999) Delta-type opioid receptor
Name:Delta-type opioid receptor
Type:G Protein-Coupled Receptor (GPCR)
Mol. Mass.:40382.98
Organism:Homo sapiens (Human)
Description:Competition binding assays were carried out using membrane preparations from transfected HN9.10 cells that constitutively expressed the delta opioid receptor.
Residue:372
BDBM50070948
NameBDBM50070948
Synonyms:1',2-dimethylspiro[2,3-dihydrobenzo[b]furan-3,4'-(hexahydropyridine)]-7-ol | CHEMBL50098
TypeSmall organic molecule
Emp. Form.C14H19NO2
Mol. Mass.233.3062
SMILESCC1Oc2c(cccc2O)C11CCN(C)CC1