Reaction Details
TargetKappa-type opioid receptor
LigandBDBM50070947
Substrate/Competitorn/a
Meas. Tech.ChEBML_146389
Ki>100000±n/a nM
Citation Tsai, YCLiou, JPLiao, RCheng, CYTao, PL C-alkylated spiro[benzofuran-3(2H),4'-1'-methyl-piperidine-7-ols] as potent opioids: a conformation-activity study. Bioorg Med Chem Lett8:1813-8 (1999) Kappa-type opioid receptor
Name:Kappa-type opioid receptor
Type:G Protein-Coupled Receptor (GPCR)
Mol. Mass.:42744.99
Organism:Cavia porcellus (domestic guinea pig)
Description:P41144
Residue:380
BDBM50070947
NameBDBM50070947
Synonyms:2-ethyl-1'-methylspiro[2,3-dihydrobenzo[b]furan-3,4'-(hexahydropyridine)]-7-ol | CHEMBL431156
TypeSmall organic molecule
Emp. Form.C15H21NO2
Mol. Mass.247.3327
SMILESCCC1Oc2c(cccc2O)C11CCN(C)CC1