Reaction Details
TargetKappa-type opioid receptor
LigandBDBM50070946
Substrate/Competitorn/a
Meas. Tech.ChEMBL_146389 (CHEMBL753185)
Ki 505±n/a nM
Citation Tsai, YCLiou, JPLiao, RCheng, CYTao, PL C-alkylated spiro[benzofuran-3(2H),4'-1'-methyl-piperidine-7-ols] as potent opioids: a conformation-activity study. Bioorg Med Chem Lett8:1813-8 (1999) Kappa-type opioid receptor
Name:Kappa-type opioid receptor
Type:G Protein-Coupled Receptor (GPCR)
Mol. Mass.:42744.99
Organism:Cavia porcellus (domestic guinea pig)
Description:P41144
Residue:380
BDBM50070946
NameBDBM50070946
Synonyms:1',3'-dimethylspiro[2,3-dihydrobenzo[b]furan-3,4'-(hexahydropyridine)]-7-ol | CHEMBL300689
TypeSmall organic molecule
Emp. Form.C14H19NO2
Mol. Mass.233.3062
SMILESCC1CN(C)CCC11COc2c1cccc2O