Reaction Details
TargetPeptidyl-prolyl cis-trans isomerase FKBP1A
LigandBDBM50071466
Substrate/Competitorn/a
Meas. Tech.ChEBML_66285
EC50 7.4±n/a nM
Citation Goulet, MTMcAlpine, SRStaruch, MJKoprak, SDumont, FJCryan, JGWiederrecht, GJRosa, RWilusz, MBPeterson, LBWyvratt, MJParsons, WH C32-O-imidazol-2-yl-methyl ether derivatives of the immunosuppressant ascomycin with improved therapeutic potential. Bioorg Med Chem Lett8:2253-8 (1999) Peptidyl-prolyl cis-trans isomerase FKBP1A
Name:Peptidyl-prolyl cis-trans isomerase FKBP1A
Type:Isomerase
Mol. Mass.:11953.09
Organism:Homo sapiens (Human)
Description:P62942
Residue:108
BDBM50071466
NameBDBM50071466
Synonyms:Ascomycin derivative | CHEMBL386482
TypeSmall organic molecule
Emp. Form.C54H79N3O12
Mol. Mass.962.218
SMILESCC[C@@H]1\C=C(C)\C[C@H](C)C[C@H](OC)[C@H]2O[C@](O)([C@H](C)C[C@@H]2OC)C(=O)C(=O)N2CCCC[C@H]2C(=O)O[C@@H]([C@H](C)[C@@H](O)CC1=O)C(\C)=C\[C@@H]1CC[C@@H](OCc2nccn2Cc2ccccc2)[C@@H](C1)OC