Reaction Details
TargetMitogen-activated protein kinase 11/12/13/14
LigandBDBM50071867
Substrate/Competitorn/a
Meas. Tech.ChEMBL_87998 (CHEMBL697600)
IC50 23±n/a nM
Citation de Laszlo, SEVisco, DAgarwal, LChang, LChin, JCroft, GForsyth, AFletcher, DFrantz, BHacker, CHanlon, WHarper, CKostura, MLi, BLuell, SMacCoss, MMantlo, NO'Neill, EAOrevillo, CPang, MParsons, JRolando, ASahly, YSidler, KO'Keefe, SJ Pyrroles and other heterocycles as inhibitors of p38 kinase. Bioorg Med Chem Lett8:2689-94 (1999) Mitogen-activated protein kinase 11/12/13/14
Name:Mitogen-activated protein kinase 11/12/13/14
Synonyms:MAP kinase p38
Type:n/a
Mol. Mass.:n/a
Description:ASSAY_ID of ChEMBL is 1935922
Components:This complex has 4 components.
Component 1
Name:Mitogen-activated protein kinase 13
Type:Enzyme
Mol. Mass.:42097.16
Organism:Homo sapiens (Human)
Description:O15264
Residue:365
Component 2
Name:Mitogen-activated protein kinase 11
Synonyms:MAP kinase p38 MK11_HUMAN Mitogen-activated protein kinase p38 beta SAPK2 Stress-activated protein kinase 2 p38-2 p38b
Type:Enzyme Catalytic Domain
Mol. Mass.:41351.73
Organism:Homo sapiens (Human)
Description:gi_20128774
Residue:364
Component 3
Name:Mitogen-activated protein kinase 14
Synonyms:CSAID-binding protein CSBP1 CSPB1 MAP kinase 14 MAP kinase p38 alpha MAPK14 MK14_HUMAN Mitogen-activated protein kinase p38 alpha Stress-activated protein kinase 2a | p38 MAP kinase alpha/beta
Type:Serine/threonine-protein kinase
Mol. Mass.:41286.76
Organism:Homo sapiens (Human)
Description:Q16539
Residue:360
Component 4
Name:Mitogen-activated protein kinase 12
Synonyms:ERK6 MAPK12 Mitogen-activated protein kinase 12 (MAPK12 p38 gamma) Mitogen-activated protein kinase 12 Gamma SAPK3 | p38 delta/gamma
Type:Protein
Mol. Mass.:41938.69
Organism:Homo sapiens (Human)
Description:P53778
Residue:367
BDBM50071867
NameBDBM50071867
Synonyms:4-[2-(4-Fluoro-phenyl)-5-(4-methanesulfonyl-phenyl)-1H-pyrrol-3-yl]-pyridine | CHEMBL316275
TypeSmall organic molecule
Emp. Form.C22H17FN2O2S
Mol. Mass.392.446
SMILESCS(=O)(=O)c1ccc(cc1)-c1cc(c([nH]1)-c1ccc(F)cc1)-c1ccncc1