Reaction Details
TargetMetabotropic glutamate receptor 2
LigandBDBM50062522
Substrate/Competitorn/a
Meas. Tech.ChEMBL_104629 (CHEMBL715576)
IC50 200±n/a nM
Citation Collado, IEzquerra, JMazón, APedregal, CYruretagoyena, BKingston, AETomlinson, RWright, RAJohnson, BGSchoepp, DD 2,3'-disubstituted-2-(2'-carboxycyclopropyl)glycines as potent and selective antagonists of metabotropic glutamate receptors. Bioorg Med Chem Lett8:2849-54 (1999) Metabotropic glutamate receptor 2
Name:Metabotropic glutamate receptor 2
Type:PROTEIN
Mol. Mass.:95786.41
Organism:Rattus norvegicus
Description:ChEMBL_105034
Residue:872
BDBM50062522
NameBDBM50062522
Synonyms:(1S,2S)-2-((S)-1-amino-1-carboxy-2-(9H-xanthen-9-yl)ethyl)cyclopropanecarboxylic acid (1S,2S)-2-[(S)-1-Amino-1-carboxy-2-(9H-xanthen-9-yl)-ethyl]-cyclopropanecarboxylic acid (S)-2-[(S)-1-Amino-1-carboxy-2-(9H-xanthen-9-yl)-ethyl]-cyclopropanecarboxylic acid 2-[1-Amino-1-carboxy-2-(9H-xanthen-9-yl)-ethyl]-cyclopropanecarboxylic acid(LY341495) | CHEMBL432038
TypeSmall organic molecule
Emp. Form.C20H19NO5
Mol. Mass.353.3686
SMILESN[C@@](CC1c2ccccc2Oc2ccccc12)([C@H]1C[C@@H]1C(O)=O)C(O)=O