Reaction Details
TargetKappa-type opioid receptor
LigandBDBM50045772
Substrate/Competitorn/a
Meas. Tech.ChEBML_146661
Ki 833±n/a nM
Citation Thomas, JBMascarella, SWBurgess, JPXu, HMcCullough, KBRothman, RBFlippen-Anderson, JLGeorge, CFCantrell, BEZimmerman, DMCarroll, FI N-substituted octahydro-4a-(3-hydroxyphenyl)-10a-methyl-benzo[g]isoquinolines are opioid receptor pure antagonists. Bioorg Med Chem Lett8:3149-52 (1999) Kappa-type opioid receptor
Name:Kappa-type opioid receptor
Type:G Protein-Coupled Receptor (GPCR)
Mol. Mass.:42744.99
Organism:Cavia porcellus (domestic guinea pig)
Description:P41144
Residue:380
BDBM50045772
NameBDBM50045772
Synonyms:3-((3R,4R)-1,3,4-Trimethyl-piperidin-4-yl)-phenol CHEMBL318723
TypeSmall organic molecule
Emp. Form.C14H21NO
Mol. Mass.219.3226
SMILESC[C@H]1CN(C)CC[C@@]1(C)c1cccc(O)c1