Reaction Details
TargetDelta-type opioid receptor
LigandBDBM50072453
Substrate/Competitorn/a
Meas. Tech.ChEBML_147042
Ki>5710±n/a nM
Citation Thomas, JBMascarella, SWBurgess, JPXu, HMcCullough, KBRothman, RBFlippen-Anderson, JLGeorge, CFCantrell, BEZimmerman, DMCarroll, FI N-substituted octahydro-4a-(3-hydroxyphenyl)-10a-methyl-benzo[g]isoquinolines are opioid receptor pure antagonists. Bioorg Med Chem Lett8:3149-52 (1999) Delta-type opioid receptor
Name:Delta-type opioid receptor
Type:G Protein-Coupled Receptor (GPCR)
Mol. Mass.:40465.04
Organism:Rattus norvegicus (rat)
Description:Competition binding assays were using CHO-K1 cell membranes expressing the opioid receptor.
Residue:372
BDBM50072453
NameBDBM50072453
Synonyms:3-((4aS,10aS)-2,10a-Dimethyl-1,3,4,5,10,10a-hexahydro-2H-benzo[g]isoquinolin-4a-yl)-phenol | CHEMBL324681
TypeSmall organic molecule
Emp. Form.C21H25NO
Mol. Mass.307.4293
SMILESCN1CC[C@@]2(Cc3ccccc3C[C@]2(C)C1)c1cccc(O)c1