Reaction Details
TargetAngiotensin-converting enzyme
LigandBDBM50073118
Substrate/Competitorn/a
Meas. Tech.ChEMBL_34793 (CHEMBL643770)
IC50 6±n/a nM
Citation Robl, JASulsky, RSieber-McMaster, ERyono, DECimarusti, MPSimpkins, LMKaranewsky, DSChao, SAsaad, MMSeymour, AAFox, MSmith, PLTrippodo, NC Vasopeptidase inhibitors: incorporation of geminal and spirocyclic substituted azepinones in mercaptoacyl dipeptides. J Med Chem42:305-11 (1999) 
 
Angiotensin-converting enzyme
Name:Angiotensin-converting enzyme
Type:n/a
Mol. Mass.:150405.15
Organism:Oryctolagus cuniculus
Description:n/a
Residue:1310
BDBM50073118
NameBDBM50073118
Synonyms:CHEMBL319237 | [(S)-8-((S)-2-Mercapto-3-phenyl-propionylamino)-7-oxo-6-aza-spiro[4.6]undec-6-yl]-acetic acid
TypeSmall organic molecule
Emp. Form.C21H28N2O4S
Mol. Mass.404.523
SMILESOC(=O)CN1C(=O)[C@H](CCCC11CCCC1)NC(=O)[C@@H](S)Cc1ccccc1