Reaction Details
TargetProthrombin
LigandBDBM50073283
Substrate/Competitorn/a
Meas. Tech.ChEBML_208323
Ki 19±n/a nM
Citation Ambler, JBaker, EBrown, LButler, PFarr, DDunnet, KLe Grand, DJanus, DJones, DMenear, KMercer, MSmith, GTalbot, MTweed, M The discovery of orally available thrombin inhibitors: studies towards the optimisation of CGH1668. Bioorg Med Chem Lett8:3583-8 (1999) Prothrombin
Name:Prothrombin
Type:Protein
Mol. Mass.:70029.57
Organism:Homo sapiens (Human)
Description:P00734
Residue:622
BDBM50073283
NameBDBM50073283
Synonyms:4-[(S)-1-Hydroxymethyl-2-(4-methoxy-phenyl)-ethylamino]-pyridine-3-sulfonic acid {(S)-1-(4-amino-benzyl)-2-[4-(2-fluoro-ethyl)-piperidin-1-yl]-2-oxo-ethyl}-amide | CHEMBL121423
TypeSmall organic molecule
Emp. Form.C31H40FN5O5S
Mol. Mass.613.743
SMILESCOc1ccc(C[C@@H](CO)Nc2ccncc2S(=O)(=O)N[C@@H](Cc2ccc(N)cc2)C(=O)N2CCC(CCF)CC2)cc1