Reaction Details
TargetProthrombin
LigandBDBM50073302
Substrate/Competitorn/a
Meas. Tech.ChEBML_208323
Ki 18±n/a nM
Citation Ambler, JBaker, EBrown, LButler, PFarr, DDunnet, KLe Grand, DJanus, DJones, DMenear, KMercer, MSmith, GTalbot, MTweed, M The discovery of orally available thrombin inhibitors: studies towards the optimisation of CGH1668. Bioorg Med Chem Lett8:3583-8 (1999) Prothrombin
Name:Prothrombin
Type:Protein
Mol. Mass.:70029.57
Organism:Homo sapiens (Human)
Description:P00734
Residue:622
BDBM50073302
NameBDBM50073302
Synonyms:4-((S)-2-Cyclohexyl-1-hydroxymethyl-ethylamino)-pyridine-3-sulfonic acid {(S)-1-(4-amino-benzyl)-2-[4-(2-fluoro-ethyl)-piperidin-1-yl]-2-oxo-ethyl}-amide | CHEMBL119637
TypeSmall organic molecule
Emp. Form.C30H44FN5O4S
Mol. Mass.589.765
SMILESNc1ccc(C[C@H](NS(=O)(=O)c2cnccc2N[C@H](CO)CC2CCCCC2)C(=O)N2CCC(CCF)CC2)cc1