Reaction Details
TargetProthrombin
LigandBDBM50073304
Substrate/Competitorn/a
Meas. Tech.ChEBML_208323
Ki 36±n/a nM
Citation Ambler, JBaker, EBrown, LButler, PFarr, DDunnet, KLe Grand, DJanus, DJones, DMenear, KMercer, MSmith, GTalbot, MTweed, M The discovery of orally available thrombin inhibitors: studies towards the optimisation of CGH1668. Bioorg Med Chem Lett8:3583-8 (1999) Prothrombin
Name:Prothrombin
Type:Protein
Mol. Mass.:70029.57
Organism:Homo sapiens (Human)
Description:P00734
Residue:622
BDBM50073304
NameBDBM50073304
Synonyms:4-((S)-1-Hydroxymethyl-2-phenyl-ethylamino)-pyridine-3-sulfonic acid [(S)-2-[4-(2-fluoro-ethyl)-piperidin-1-yl]-1-(4-methoxy-benzyl)-2-oxo-ethyl]-amide | CHEMBL118428
TypeSmall organic molecule
Emp. Form.C31H39FN4O5S
Mol. Mass.598.729
SMILESCOc1ccc(C[C@H](NS(=O)(=O)c2cnccc2N[C@H](CO)Cc2ccccc2)C(=O)N2CCC(CCF)CC2)cc1