Reaction Details
TargetInterstitial collagenase
LigandBDBM50073831
Substrate/Competitorn/a
Meas. Tech.ChEBML_101745
IC50 180±n/a nM
Citation Reiter, LARizzi, JPPandit, JLasut, MJMcGahee, SMParikh, VDBlake, JFDanley, DELaird, ERLopez-Anaya, ALopresti-Morrow, LLMansour, MNMartinelli, GJMitchell, PGOwens, BSPauly, TAReeves, LMSchulte, GKYocum, SA Inhibition of MMP-1 and MMP-13 with phosphinic acids that exploit binding in the S2 pocket. Bioorg Med Chem Lett9:127-32 (1999) Interstitial collagenase
Name:Interstitial collagenase
Type:Enzyme
Mol. Mass.:54010.26
Organism:Homo sapiens (Human)
Description: P03956
Residue:469
BDBM50073831
NameBDBM50073831
Synonyms:(4-Benzyl-benzyl)-[3-cyclobutyl-2-((R)-2,2-dimethyl-1-methylcarbamoyl-propylcarbamoyl)-propyl]-phosphinic acid | CHEMBL27439
TypeSmall organic molecule
Emp. Form.C29H41N2O4P
Mol. Mass.512.6206
SMILESCNC(=O)[C@H](NC(=O)C(CC1CCC1)CP(O)(=O)Cc1ccc(Cc2ccccc2)cc1)C(C)(C)C