Reaction Details
TargetCytochrome P450 1A1
LigandBDBM50159614
Substrate/Competitorn/a
Meas. Tech.ChEMBL_1878664 (CHEMBL4380058)
IC50 12±n/a nM
Citation Dong, JWang, ZCui, JMeng, QLi, S Synthesis and structure-activity relationship studies of ?-naphthoflavone derivatives as CYP1B1 inhibitors. Eur J Med Chem187:0 (2020) 
 
Cytochrome P450 1A1
Name:Cytochrome P450 1A1
Type:Protein
Mol. Mass.:58177.23
Organism:Homo sapiens (Human)
Description:P04798
Residue:512
BDBM50159614
NameBDBM50159614
Synonyms:2-(2-Fluoro-phenyl)-benzo[h]chromen-4-one | CHEMBL361608
TypeSmall organic molecule
Emp. Form.C19H11FO2
Mol. Mass.290.2878
SMILESFc1ccccc1-c1cc(=O)c2ccc3ccccc3c2o1