Reaction Details
TargetTyrosine-protein kinase Lck
LigandBDBM50074245
Substrate/Competitorn/a
Meas. Tech.ChEMBL_221516 (CHEMBL841499)
Kd 2500±n/a nM
Citation Llinas-Brunet, MBeaulieu, PLCameron, DRFerland, JMGauthier, JGhiro, EGillard, JGorys, VPoirier, MRancourt, JWernic, DBetageri, RCardozo, MJakes, SLukas, SPatel, UProudfoot, JMoss, N Phosphotyrosine-containing dipeptides as high-affinity ligands for the p56lck SH2 domain. J Med Chem42:722-9 (1999) 
 
Tyrosine-protein kinase Lck
Name:Tyrosine-protein kinase Lck
Type:n/a
Mol. Mass.:57987.83
Organism:Homo sapiens (Human)
Description:P06239
Residue:509
BDBM50074245
NameBDBM50074245
Synonyms:CHEMBL164429 | Phosphoric acid mono-(4-{(S)-2-acetylamino-2-[(S)-3-methyl-1-(4-methyl-benzylcarbamoyl)-butylcarbamoyl]-ethyl}-phenyl) ester
TypeSmall organic molecule
Emp. Form.C25H34N3O7P
Mol. Mass.519.5271
SMILESCC(C)C[C@H](NC(=O)[C@H](Cc1ccc(OP(O)(O)=O)cc1)NC(C)=O)C(=O)NCc1ccc(C)cc1