Reaction Details
TargetTyrosine-protein kinase Lck
LigandBDBM50074250
Substrate/Competitorn/a
Meas. Tech.ChEMBL_221516 (CHEMBL841499)
Kd 12000±n/a nM
Citation Llinas-Brunet, MBeaulieu, PLCameron, DRFerland, JMGauthier, JGhiro, EGillard, JGorys, VPoirier, MRancourt, JWernic, DBetageri, RCardozo, MJakes, SLukas, SPatel, UProudfoot, JMoss, N Phosphotyrosine-containing dipeptides as high-affinity ligands for the p56lck SH2 domain. J Med Chem42:722-9 (1999) 
 
Tyrosine-protein kinase Lck
Name:Tyrosine-protein kinase Lck
Type:n/a
Mol. Mass.:57987.83
Organism:Homo sapiens (Human)
Description:P06239
Residue:509
BDBM50074250
NameBDBM50074250
Synonyms:CHEMBL163548 | Phosphoric acid mono-(4-{(S)-2-acetylamino-2-[(S)-1-(3,4-dimethoxy-benzylcarbamoyl)-3-methyl-butylcarbamoyl]-ethyl}-phenyl) ester
TypeSmall organic molecule
Emp. Form.C26H36N3O9P
Mol. Mass.565.5525
SMILESCOc1ccc(CNC(=O)[C@H](CC(C)C)NC(=O)[C@H](Cc2ccc(OP(O)(O)=O)cc2)NC(C)=O)cc1OC