Reaction Details
TargetTyrosine-protein kinase Lck
LigandBDBM50074251
Substrate/Competitorn/a
Meas. Tech.ChEMBL_221516 (CHEMBL841499)
Kd 27000±n/a nM
Citation Llinas-Brunet, MBeaulieu, PLCameron, DRFerland, JMGauthier, JGhiro, EGillard, JGorys, VPoirier, MRancourt, JWernic, DBetageri, RCardozo, MJakes, SLukas, SPatel, UProudfoot, JMoss, N Phosphotyrosine-containing dipeptides as high-affinity ligands for the p56lck SH2 domain. J Med Chem42:722-9 (1999) 
 
Tyrosine-protein kinase Lck
Name:Tyrosine-protein kinase Lck
Type:n/a
Mol. Mass.:57987.83
Organism:Homo sapiens (Human)
Description:P06239
Residue:509
BDBM50074251
NameBDBM50074251
Synonyms:(S)-4-[(S)-2-Acetylamino-3-(4-phosphonooxy-phenyl)-propionylamino]-4-carbamoyl-butyric acid | CHEMBL293731
TypeSmall organic molecule
Emp. Form.C16H22N3O9P
Mol. Mass.431.3343
SMILESCC(=O)N[C@@H](Cc1ccc(OP(O)(O)=O)cc1)C(=O)N[C@@H](CCC(O)=O)C(N)=O