Reaction Details
TargetTyrosine-protein kinase Lck
LigandBDBM50074254
Substrate/Competitorn/a
Meas. Tech.ChEMBL_221516 (CHEMBL841499)
Kd 8000±n/a nM
Citation Llinas-Brunet, MBeaulieu, PLCameron, DRFerland, JMGauthier, JGhiro, EGillard, JGorys, VPoirier, MRancourt, JWernic, DBetageri, RCardozo, MJakes, SLukas, SPatel, UProudfoot, JMoss, N Phosphotyrosine-containing dipeptides as high-affinity ligands for the p56lck SH2 domain. J Med Chem42:722-9 (1999) 
 
Tyrosine-protein kinase Lck
Name:Tyrosine-protein kinase Lck
Type:n/a
Mol. Mass.:57987.83
Organism:Homo sapiens (Human)
Description:P06239
Residue:509
BDBM50074254
NameBDBM50074254
Synonyms:CHEMBL160105 | Phosphoric acid mono-(4-{(S)-2-acetylamino-2-[(S)-1-(4-tert-butyl-benzylcarbamoyl)-3-methyl-butylcarbamoyl]-ethyl}-phenyl) ester
TypeSmall organic molecule
Emp. Form.C28H40N3O7P
Mol. Mass.561.6069
SMILESCC(C)C[C@H](NC(=O)[C@H](Cc1ccc(OP(O)(O)=O)cc1)NC(C)=O)C(=O)NCc1ccc(cc1)C(C)(C)C