Reaction Details
TargetTyrosine-protein kinase Lck
LigandBDBM50074258
Substrate/Competitorn/a
Meas. Tech.ChEMBL_221516 (CHEMBL841499)
Kd 17000±n/a nM
Citation Llinas-Brunet, MBeaulieu, PLCameron, DRFerland, JMGauthier, JGhiro, EGillard, JGorys, VPoirier, MRancourt, JWernic, DBetageri, RCardozo, MJakes, SLukas, SPatel, UProudfoot, JMoss, N Phosphotyrosine-containing dipeptides as high-affinity ligands for the p56lck SH2 domain. J Med Chem42:722-9 (1999) 
 
Tyrosine-protein kinase Lck
Name:Tyrosine-protein kinase Lck
Type:n/a
Mol. Mass.:57987.83
Organism:Homo sapiens (Human)
Description:P06239
Residue:509
BDBM50074258
NameBDBM50074258
Synonyms:CHEMBL351905 | Phosphoric acid mono-(4-{(S)-2-acetylamino-2-[(S)-1-(2-methoxy-benzylcarbamoyl)-3-methyl-butylcarbamoyl]-ethyl}-phenyl) ester
TypeSmall organic molecule
Emp. Form.C25H34N3O8P
Mol. Mass.535.5265
SMILESCOc1ccccc1CNC(=O)[C@H](CC(C)C)NC(=O)[C@H](Cc1ccc(OP(O)(O)=O)cc1)NC(C)=O