Reaction Details
TargetTyrosine-protein kinase Lck
LigandBDBM50074261
Substrate/Competitorn/a
Meas. Tech.ChEMBL_221516 (CHEMBL841499)
Kd 200±n/a nM
Citation Llinas-Brunet, MBeaulieu, PLCameron, DRFerland, JMGauthier, JGhiro, EGillard, JGorys, VPoirier, MRancourt, JWernic, DBetageri, RCardozo, MJakes, SLukas, SPatel, UProudfoot, JMoss, N Phosphotyrosine-containing dipeptides as high-affinity ligands for the p56lck SH2 domain. J Med Chem42:722-9 (1999) 
 
Tyrosine-protein kinase Lck
Name:Tyrosine-protein kinase Lck
Type:n/a
Mol. Mass.:57987.83
Organism:Homo sapiens (Human)
Description:P06239
Residue:509
BDBM50074261
NameBDBM50074261
Synonyms:(S)-4-[(S)-2-Acetylamino-3-(4-phosphonooxy-phenyl)-propionylamino]-4-(4-methoxy-benzylcarbamoyl)-butyric acid | CHEMBL413096
TypeSmall organic molecule
Emp. Form.C24H30N3O10P
Mol. Mass.551.4829
SMILESCOc1ccc(CNC(=O)[C@H](CCC(O)=O)NC(=O)[C@H](Cc2ccc(OP(O)(O)=O)cc2)NC(C)=O)cc1